Auteur Topic: error NoneType  (gelezen 5164 keer)

Offline leurb

  • Bedankjes
  • -Gegeven: 12
  • -Ontvangen: 8
  • Berichten: 72
error NoneType
« Gepost op: 22 april 2018, 10:16:45 »
Ik heb onderstaande error sinds de laatste grote update.
22-04 10:09:06 ERR _walkDir       :Problem scanning file Evelien.S02E10.480p.sdtv.avi. Error is: 'NoneType' object has no attribute 'geta7ID'

Het betreft een Nederlandse serie dus hij staat gewoon in de "skipshow list" en er is ook een IMDB verwijzing naar.
De foutmelding lijkt mogelijk te verwijzen naar het feit dat de serie niet op addic7ed is te vinden en dat klopt want hij bestaat daar niet. Indien dat juist is kan je dan ergens een uitzondering hiervoor maken.

p.s. auto-sub werkt prima maar je wilt je zo min mogelijk errors in je log voor als je ergens naar moet zoeken.

tia
Leurb
  • Mijn Synology: DS918+
  • HDD's: 3 x WD60EFRX-68L0BN1
  • Extra's: Ups+4GB Ram

Ben(V)

  • Gast
Re: error NoneType
« Reactie #1 Gepost op: 22 april 2018, 10:37:00 »
Ja is een bugje, wordt in de volgende release opgelost.

Offline leurb

  • Bedankjes
  • -Gegeven: 12
  • -Ontvangen: 8
  • Berichten: 72
Re: error NoneType
« Reactie #2 Gepost op: 22 april 2018, 12:17:33 »
 :thumbup:

gr.
Leon
  • Mijn Synology: DS918+
  • HDD's: 3 x WD60EFRX-68L0BN1
  • Extra's: Ups+4GB Ram


 

Certificaat error met link naar Album

Gestart door HHGDBoard Synology DSM algemeen

Reacties: 9
Gelezen: 3957
Laatste bericht 24 november 2015, 10:29:25
door Briolet
VERPLAATST: Cleantalk error

Gestart door BirdyBoard DDNS / Quick Connect / EZ-Internet / Portforwarding

Reacties: 0
Gelezen: 1142
Laatste bericht 03 oktober 2019, 15:38:07
door Birdy
VERPLAATST: DSM7 Active Backup krijg backup niet compleet (error 21, snapshots, etc...)

Gestart door BirdyBoard Officiƫle Packages

Reacties: 0
Gelezen: 789
Laatste bericht 27 september 2021, 21:21:05
door Birdy
Internal Server Error 500 - Ik word er zo schijt ziek van.

Gestart door laapsaapBoard NAS hardware vragen

Reacties: 12
Gelezen: 6980
Laatste bericht 11 november 2014, 16:13:26
door Erwin1
Error na upgrade naar 6.0.2-8451-7.

Gestart door boosterkeBoard Spotweb

Reacties: 5
Gelezen: 2968
Laatste bericht 09 januari 2017, 14:50:02
door boosterke